BDBM51364 (4-thiophen-2-yl-2-pyrimidinyl)thiourea::(4-thiophen-2-ylpyrimidin-2-yl)thiourea::1-(4-thiophen-2-ylpyrimidin-2-yl)thiourea::MLS000763979::N-[4-(2-thienyl)-2-pyrimidinyl]thiourea::SMR000336116::[4-(2-thienyl)pyrimidin-2-yl]thiourea::cid_1482759
SMILES NC(=S)Nc1nccc(n1)-c1cccs1
InChI Key InChIKey=POTPPCPRBDFTRJ-UHFFFAOYSA-N
Data  1 IC50
  Tab Delimited (TSV)   2D SDfile   Computed 3D by Vconf -m prep SDfile
Find this compound or compounds like it in BindingDB:
Activity Spreadsheet -- Enzyme Inhibition Constant Data from BindingDB
Found 1 hit for monomerid = 51364
TargetDNA repair protein RAD51 homolog 1(Homo sapiens (Human))
Pcmd
Curated by PubChem BioAssay
LigandPNGBDBM51364((4-thiophen-2-yl-2-pyrimidinyl)thiourea | (4-thiop...)
Affinity DataIC50:  5.30E+4nM. Assay description: Project Title: A screen for modulators of human Rad51, a key DNA repair protein Application Number: MH084119 Assay Submitter: Dr. Alex Mazin Submitte...
In DepthDetails PCBioAssay