BDBM56102 MLS000048051::N-methyl-N-(3-methylbutyl)-1-[3-(trifluoromethyl)phenyl]sulfonyl-4-piperidinamine;hydrochloride::N-methyl-N-(3-methylbutyl)-1-[3-(trifluoromethyl)phenyl]sulfonyl-piperidin-4-amine;hydrochloride::N-methyl-N-(3-methylbutyl)-1-[3-(trifluoromethyl)phenyl]sulfonylpiperidin-4-amine;hydrochloride::N-methyl-N-(3-methylbutyl)-1-{[3-(trifluoromethyl)phenyl]sulfonyl}piperidin-4-amine::SMR000034032::cid_6602880::isoamyl-methyl-[1-[3-(trifluoromethyl)phenyl]sulfonyl-4-piperidyl]amine;hydrochloride
SMILES CC(C)CCN(C)C1CCN(CC1)S(=O)(=O)c1cccc(c1)C(F)(F)F
InChI Key InChIKey=UDIPKFLRHYYUDF-UHFFFAOYSA-N
Data  1 IC50  1 EC50
  Tab Delimited (TSV)   2D SDfile   Computed 3D by Vconf -m prep SDfile
Find this compound or compounds like it in BindingDB:
Activity Spreadsheet -- Enzyme Inhibition Constant Data from BindingDB
Found 2 hits for monomerid = 56102
TargetProtein LANA1(Human herpesvirus 8)
Broad Institute
Curated by PubChem BioAssay
LigandPNGBDBM56102(MLS000048051 | N-methyl-N-(3-methylbutyl)-1-[3-(tr...)
Affinity DataEC50: >7.50E+4nM. Assay description: Primary Collaborators: Kenneth Kaye,Brigham & Womens,Boston MA,kkaye@rics.bwh.harvard.edu,617-525-4256 Chantal Beauchemin,Brigham & Womens,Boston MA,...
In DepthDetails PCBioAssay
TargetKallikrein-5(Homo sapiens (Human))
Pcmd
Curated by PubChem BioAssay
LigandPNGBDBM56102(MLS000048051 | N-methyl-N-(3-methylbutyl)-1-[3-(tr...)
Affinity DataIC50:  5.00E+4nM. Assay description: Molecular Library Screening Center Network (MLSCN) Penn Center for Molecular Discovery (PCMD) Assay Provider: Scott L. Diamond, University of Pennsy...
In DepthDetails PCBioAssay