BDBM57436 1-[2-[(3,4-dichlorobenzyl)thio]ethyl]-3-phenyl-thiourea::1-[2-[(3,4-dichlorophenyl)methylsulfanyl]ethyl]-3-phenyl-thiourea::1-[2-[(3,4-dichlorophenyl)methylsulfanyl]ethyl]-3-phenylthiourea::1-[2-[(3,4-dichlorophenyl)methylthio]ethyl]-3-phenylthiourea::MLS000575256::N-{2-[(3,4-dichlorobenzyl)thio]ethyl}-N'-phenylthiourea::SMR000196491::cid_2290454
SMILES Clc1ccc(CSCCNC(=S)Nc2ccccc2)cc1Cl
InChI Key InChIKey=UXHWHZAJGCEOTL-UHFFFAOYSA-N
Data  3 IC50  2 EC50
  Tab Delimited (TSV)   2D SDfile   Computed 3D by Vconf -m prep SDfile
Find this compound or compounds like it in BindingDB:
Activity Spreadsheet -- Enzyme Inhibition Constant Data from BindingDB
Found 5 hits for monomerid = 57436
TargetStreptokinase A(Streptococcus pyogenes M1 GAS)
Broad Institute
Curated by PubChem BioAssay
LigandPNGBDBM57436(1-[2-[(3,4-dichlorobenzyl)thio]ethyl]-3-phenyl-thi...)
Affinity DataEC50:  1.44E+4nM. Assay description: Keywords: Group A streptococcus, GAS, streptokinase, expression, virulence, inhibition, dose response, EC50 Assay Overview: The goal of this assa...
In DepthDetails PCBioAssay
TargetHeat shock factor protein 1(Mus musculus)
Broad Institute
Curated by PubChem BioAssay
LigandPNGBDBM57436(1-[2-[(3,4-dichlorobenzyl)thio]ethyl]-3-phenyl-thi...)
Affinity DataEC50: >2.60E+5nM. Assay description: Keywords: Heat Shock Factor-1 (HSF-1), Stress Response, MG132, NIH3T3, Luminescence Assay Overview: Confirmation testing of small molecules identifie...
In DepthDetails PCBioAssay
TargetMethionine--tRNA ligase(Trypanosoma brucei brucei strain 927/4 GUTat10.1)
The Scripps Research Institute Molecular Screening Center
Curated by PubChem BioAssay
LigandPNGBDBM57436(1-[2-[(3,4-dichlorobenzyl)thio]ethyl]-3-phenyl-thi...)
Affinity DataIC50:  1.16E+4nM
In DepthDetails PCBioAssay
TargetPhospholipase A2(Homo sapiens (Human))
Burnham Center For Chemical Genomics
Curated by PubChem BioAssay
LigandPNGBDBM57436(1-[2-[(3,4-dichlorobenzyl)thio]ethyl]-3-phenyl-thi...)
Affinity DataIC50:  3.24E+3nM. Assay description: Data Source: Sanford-Burnham Center for Chemical Genomics (SBCCG) Source Affiliation: Sanford-Burnham Medical Research Institute (SBMRI, San Diego, C...
In DepthDetails PCBioAssay
TargetCysteine protease ATG4B(Homo sapiens (Human))
Burnham Center For Chemical Genomics
Curated by PubChem BioAssay
LigandPNGBDBM57436(1-[2-[(3,4-dichlorobenzyl)thio]ethyl]-3-phenyl-thi...)
Affinity DataIC50:  6.67E+3nM. Assay description: Data Source: Sanford-Burnham Center for Chemical Genomics (SBCCG) Source Affiliation: Sanford-Burnham Medical Research Institute (SBMRI, San Diego, C...
In DepthDetails PCBioAssay