BDBM600 2-[(2R)-2-[(2R,4S)-4-[(2-{[(2R,4S)-2-[(R)-[(carboxymethyl)carbamoyl](1-phenylacetamido)methyl]-5,5-dimethyl-1,3-thiazolidin-4-yl]formamido}ethyl)carbamoyl]-5,5-dimethyl-1,3-thiazolidin-2-yl]-2-(1-phenylacetamido)acetamido]acetic acid::Penicillin Et(NH)2 Sym dimer ::penicillin deriv. 13
SMILES [H][C@]1(N[C@@H](C(=O)NCCNC(=O)[C@@H]2N[C@]([H])(SC2(C)C)[C@H](NC(=O)Cc2ccccc2)C(=O)NCC(O)=O)C(C)(C)S1)[C@H](NC(=O)Cc1ccccc1)C(=O)NCC(O)=O
InChI Key InChIKey=XHDOJHIGYFGOND-HTCODBRUSA-N
Data  1 IC50
  Tab Delimited (TSV)   2D SDfile   Computed 3D by Vconf -m prep SDfile
Find this compound or compounds like it in BindingDB:
Activity Spreadsheet -- Enzyme Inhibition Constant Data from BindingDB
Found 1 hit for monomerid = 600
TargetDimer of Gag-Pol polyprotein [489-587](Human immunodeficiency virus type 1)
Glaxo Group Research
LigandPNGBDBM600(2-[(2R)-2-[(2R,4S)-4-[(2-{[(2R,4S)-2-[(R)-[(carbox...)
Affinity DataIC50:  39nMpH: 6.0 T: 2°C. Assay description: IC50 values were obtained by assaying the enzyme against the synthetic substrate peptide KQGTVSFNFPQIT, which was tritiated at the proline residue, a...
In DepthDetails ArticlePubMed