BDBM6124 3-quinolinecarbonitrile 10::6,7-bis(2-methoxyethoxy)-4-[(3,4,5-trimethoxyphenyl)amino]quinoline-3-carbonitrile
SMILES COCCOc1cc2ncc(C#N)c(Nc3cc(OC)c(OC)c(OC)c3)c2cc1OCCOC
InChI Key InChIKey=BTBPPLGKNLXRGR-UHFFFAOYSA-N
Data  1 IC50
  Tab Delimited (TSV)   2D SDfile   Computed 3D by Vconf -m prep SDfile
Find this compound or compounds like it in BindingDB:
Activity Spreadsheet -- Enzyme Inhibition Constant Data from BindingDB
Found 1 hit for monomerid = 6124
TargetProto-oncogene tyrosine-protein kinase Src(Homo sapiens (Human))
Wyeth Research
LigandPNGBDBM6124(3-quinolinecarbonitrile 10 | 6,7-bis(2-methoxyetho...)
Affinity DataIC50:  25nM. Assay description: Src kinase activity was measured in an ELISA format. IC50 is the inhibitor concentration which inhibits 50% of kinase activity that catalyzes the tra...
In DepthDetails ArticlePubMed