BDBM61434 3'-(4-fluorophenyl)-4,4,6,8-tetramethyl-4H,4'H-spiro[pyrrolo[3,2,1-ij]quinoline-1,2'-[1,3]thiazolidine]-2,4'-dione::MLS000538872::SMR000144709::cid_2981819
SMILES CC1=CC(C)(C)N2C(=O)C3(SCC(=O)N3c3ccc(F)cc3)c3cc(C)cc1c23
InChI Key InChIKey=LAMFLBUXIPOABX-UHFFFAOYSA-N
Data  4 IC50
  Tab Delimited (TSV)   2D SDfile   Computed 3D by Vconf -m prep SDfile
Find this compound or compounds like it in BindingDB:
Activity Spreadsheet -- Enzyme Inhibition Constant Data from BindingDB
Found 4 hits for monomerid = 61434
TargetG-protein coupled receptor 55(Homo sapiens (Human))
Burnham Center For Chemical Genomics
Curated by PubChem BioAssay
LigandPNGBDBM61434(3'-(4-fluorophenyl)-4,4,6,8-tetramethyl-4H,4&#...)
Affinity DataIC50:  4.09E+3nM. Assay description: Data Source: Sanford-Burnham Center for Chemical Genomics (SBCCG) Source Affiliation: Sanford-Burnham Medical Research Institute (SBMRI, San Diego, C...
In DepthDetails PCBioAssay
TargetDNA damage-inducible transcript 3 protein(Mus musculus)
Emory University
Curated by PubChem BioAssay
LigandPNGBDBM61434(3'-(4-fluorophenyl)-4,4,6,8-tetramethyl-4H,4&#...)
Affinity DataIC50:  9.60E+3nM. Assay description: NIH Molecular Libraries Screening Centers Network [MLSCN] Emory Chemical Biology Discovery Center in MLSCN Assay provider: Dr. Randal Kaufman, Univer...
In DepthDetails PCBioAssay
TargetX-box-binding protein 1(Homo sapiens (Human))
Emory University
Curated by PubChem BioAssay
LigandPNGBDBM61434(3'-(4-fluorophenyl)-4,4,6,8-tetramethyl-4H,4&#...)
Affinity DataIC50:  160nM. Assay description: NIH Molecular Libraries Screening Centers Network [MLSCN] Emory Chemical Biology Discovery Center in MLSCN Assay provider: Dr. Randal Kaufman, Univer...
In DepthDetails PCBioAssay
TargetDNA damage-inducible transcript 3 protein(Mus musculus)
Emory University
Curated by PubChem BioAssay
LigandPNGBDBM61434(3'-(4-fluorophenyl)-4,4,6,8-tetramethyl-4H,4&#...)
Affinity DataIC50:  9.60E+3nM. Assay description: NIH Molecular Libraries Screening Centers Network [MLSCN] Emory Chemical Biology Discovery Center in MLSCN Assay provider: Dr. Randal Kaufman, Univer...
In DepthDetails PCBioAssay