BDBM65554 Synthesized Sulfanylacrylonitril Derivatives 5
SMILES CS\C(Nc1cccc(c1)C(F)(F)F)=C(\C#N)S(=O)(=O)c1ccccc1
InChI Key InChIKey=PBXSVMQAIKMQCE-NXVVXOECSA-N
Data  1 IC50
  Tab Delimited (TSV)   2D SDfile   Computed 3D by Vconf -m prep SDfile
Find this compound or compounds like it in BindingDB:
Activity Spreadsheet -- Enzyme Inhibition Constant Data from BindingDB
Found 1 hit for monomerid = 65554
TargetAP-4-A phosphorylase(Mycobacterium tuberculosis (strain ATCC 25618 / H3...)
University of Konstanz
LigandPNGBDBM65554(Synthesized Sulfanylacrylonitril Derivatives 5)
Affinity DataIC50:  120nMpH: 8.0Assay Description:Dose response curves against Rv2613c with 1 as the substrate for derivatives 5 and 18. 8 nM of Rv2613c were preincubated in buffer (20 mM Tris-HCl (p...
Ligand InfoPC cidPC sid
In DepthDetails ArticlePubMed