BDBM67779 (6Z)-4-chloranyl-6-(5-phenyl-1,2-dihydropyrazol-3-ylidene)cyclohexa-2,4-dien-1-one::(6Z)-4-chloro-6-(5-phenyl-1,2-dihydropyrazol-3-ylidene)-1-cyclohexa-2,4-dienone::(6Z)-4-chloro-6-(5-phenyl-1,2-dihydropyrazol-3-ylidene)cyclohexa-2,4-dien-1-one::(6Z)-4-chloro-6-(5-phenyl-3-pyrazolin-3-ylidene)cyclohexa-2,4-dien-1-one::MLS000114270::SMR000091684::cid_5339816
SMILES Oc1ccc(Cl)cc1-c1cc([nH]n1)-c1ccccc1
InChI Key InChIKey=GQKWBLRKKSSCQQ-UHFFFAOYSA-N
Data  3 IC50
  Tab Delimited (TSV)   2D SDfile   Computed 3D by Vconf -m prep SDfile
Find this compound or compounds like it in BindingDB:
Activity Spreadsheet -- Enzyme Inhibition Constant Data from BindingDB
Found 3 hits for monomerid = 67779
TargetDNA damage-inducible transcript 3 protein(Mus musculus)
Emory University
Curated by PubChem BioAssay
LigandPNGBDBM67779((6Z)-4-chloranyl-6-(5-phenyl-1,2-dihydropyrazol-3-...)
Affinity DataIC50:  4.78E+3nM. Assay description: NIH Molecular Libraries Screening Centers Network [MLSCN] Emory Chemical Biology Discovery Center in MLSCN Assay provider: Dr. Randal Kaufman, Univer...
In DepthDetails PCBioAssay
TargetDNA damage-inducible transcript 3 protein(Mus musculus)
Emory University
Curated by PubChem BioAssay
LigandPNGBDBM67779((6Z)-4-chloranyl-6-(5-phenyl-1,2-dihydropyrazol-3-...)
Affinity DataIC50:  4.78E+3nM. Assay description: NIH Molecular Libraries Screening Centers Network [MLSCN] Emory Chemical Biology Discovery Center in MLSCN Assay provider: Dr. Randal Kaufman, Univer...
In DepthDetails PCBioAssay
TargetX-box-binding protein 1(Homo sapiens (Human))
Emory University
Curated by PubChem BioAssay
LigandPNGBDBM67779((6Z)-4-chloranyl-6-(5-phenyl-1,2-dihydropyrazol-3-...)
Affinity DataIC50:  1.00E+4nM. Assay description: NIH Molecular Libraries Screening Centers Network [MLSCN] Emory Chemical Biology Discovery Center in MLSCN Assay provider: Dr. Randal Kaufman, Univer...
In DepthDetails PCBioAssay