BDBM69909 (2E)-N-[3-(4-ethyl-1-piperazinyl)propyl]-2-[(3-methylphenyl)methylidene]-3-oxo-4H-1,4-benzothiazine-6-carboxamide::(2E)-N-[3-(4-ethylpiperazin-1-yl)propyl]-2-[(3-methylphenyl)methylidene]-3-oxidanylidene-4H-1,4-benzothiazine-6-carboxamide::(2E)-N-[3-(4-ethylpiperazin-1-yl)propyl]-2-[(3-methylphenyl)methylidene]-3-oxo-4H-1,4-benzothiazine-6-carboxamide::(2E)-N-[3-(4-ethylpiperazino)propyl]-3-keto-2-(3-methylbenzylidene)-4H-1,4-benzothiazine-6-carboxamide::MLS000925184::SMR000624058::cid_24789560
SMILES CCN1CCN(CCCNC(=O)c2ccc3S\C(=C\c4cccc(C)c4)C(=O)Nc3c2)CC1
InChI Key InChIKey=JSXANYJOQKBRSZ-JJIBRWJFSA-N
Data  1 IC50  1 EC50
  Tab Delimited (TSV)   2D SDfile   Computed 3D by Vconf -m prep SDfile
Find this compound or compounds like it in BindingDB:
Activity Spreadsheet -- Enzyme Inhibition Constant Data from BindingDB
Found 2 hits for monomerid = 69909
TargetUbiquitin-conjugating enzyme E2 N(Homo sapiens (Human))
Burnham Center For Chemical Genomics
Curated by PubChem BioAssay
LigandPNGBDBM69909((2E)-N-[3-(4-ethyl-1-piperazinyl)propyl]-2-[(3-met...)
Affinity DataIC50: >2.00E+4nM. Assay description: Data Source: Sanford-Burnham Center for Chemical Genomics (SBCCG) Source Affiliation: Sanford-Burnham Medical Research Institute (SBMRI, San Diego CA...
In DepthDetails PCBioAssay
TargetGlycogen synthase kinase-3 beta(Homo sapiens (Human))
Broad Institute
Curated by PubChem BioAssay
LigandPNGBDBM69909((2E)-N-[3-(4-ethyl-1-piperazinyl)propyl]-2-[(3-met...)
Affinity DataEC50:  1.61E+4nM. Assay description: Keywords: GSK3beta, dose response, kinase, inhibition, HTS Assay Overview: The glycogen synthase kinase-3 beta (GSK-3b) is a known master regulator f...
In DepthDetails PCBioAssay