BDBM76661 2-(4-Methoxy-phenyl)-quinazolin-4-ol::2-(4-methoxyphenyl)-1H-quinazolin-4-one::MLS001205826::SMR000523524::cid_388017
SMILES COc1ccc(cc1)-c1nc2ccccc2c(=O)[nH]1
InChI Key InChIKey=HETSSARHFAGODR-UHFFFAOYSA-N
Data  3 IC50
PDB links: 1 PDB ID matches this monomer.
  Tab Delimited (TSV)   2D SDfile   Computed 3D by Vconf -m prep SDfile
Find this compound or compounds like it in BindingDB:
Activity Spreadsheet -- Enzyme Inhibition Constant Data from BindingDB
Found 3 hits for monomerid = 76661
TargetCaspase-3(Homo sapiens (Human))
Burnham Center For Chemical Genomics
Curated by PubChem BioAssay
LigandPNGBDBM76661(2-(4-Methoxy-phenyl)-quinazolin-4-ol | 2-(4-methox...)
Affinity DataIC50:  6.83E+3nM. Assay description: Data Source: Sanford-Burnham Center for Chemical Genomics (SBCCG) Source Affiliation: Sanford-Burnham Medical Research Institute (SBMRI, San Diego, C...
In DepthDetails PCBioAssay
TargetSentrin-specific protease 6(Homo sapiens (Human))
Burnham Center For Chemical Genomics
Curated by PubChem BioAssay
LigandPNGBDBM76661(2-(4-Methoxy-phenyl)-quinazolin-4-ol | 2-(4-methox...)
Affinity DataIC50:  1.73E+4nM. Assay description: Data Source: Sanford-Burnham Center for Chemical Genomics (SBCCG) Source Affiliation: Sanford-Burnham Medical Research Institute (SBMRI, San Diego, C...
In DepthDetails PCBioAssay
TargetSentrin-specific protease 8(Homo sapiens (Human))
Burnham Center For Chemical Genomics
Curated by PubChem BioAssay
LigandPNGBDBM76661(2-(4-Methoxy-phenyl)-quinazolin-4-ol | 2-(4-methox...)
Affinity DataIC50: >1.00E+5nM. Assay description: Data Source: Sanford-Burnham Center for Chemical Genomics (SBCCG) Source Affiliation: Sanford-Burnham Medical Research Institute (SBMRI, San Diego, C...
In DepthDetails PCBioAssay