BDBM78868 MLS000779371::N,N-Diethyl-N'-(5-morpholin-4-yl-1,2,3,4-tetrahydro-7-thia-6,9,11-triaza-benzo[c]fluoren-8-yl)-ethane-1,2 -diamine::SMR000416085::cid_3831985
SMILES CCN(CC)CCNc1ncnc2c1sc1nc(N3CCOCC3)c3CCCCc3c21
InChI Key InChIKey=BDSHHQZMJSYVRC-UHFFFAOYSA-N
Data  1 IC50
  Tab Delimited (TSV)   2D SDfile   Computed 3D by Vconf -m prep SDfile
Find this compound or compounds like it in BindingDB:
Activity Spreadsheet -- Enzyme Inhibition Constant Data from BindingDB
Found 1 hit for monomerid = 78868
TargetUbiquitin-conjugating enzyme E2 N(Homo sapiens (Human))
Burnham Center For Chemical Genomics
Curated by PubChem BioAssay
LigandPNGBDBM78868(MLS000779371 | N,N-Diethyl-N'-(5-morpholin-4-y...)
Affinity DataIC50: >2.00E+4nM. Assay description: Data Source: Sanford-Burnham Center for Chemical Genomics (SBCCG) Source Affiliation: Sanford-Burnham Medical Research Institute (SBMRI, San Diego CA...
In DepthDetails PCBioAssay