BDBM861 1OH-2(Cbz-Tle)3PhPr [14]paracyclophane deriv. 16::tert-butyl N-[(1S,2S)-1-[(10R,13R)-9,12-dioxo-10-(propan-2-yl)-2,5-dioxa-8,11,14-triazabicyclo[14.2.2]icosa-1(18),16,19-trien-13-yl]-1-hydroxy-3-phenylpropan-2-yl]carbamate
SMILES CC(C)C1NC(=O)[C@H](NCc2ccc(OCCOCCNC1=O)cc2)C(O)[C@H](Cc1ccccc1)NC(=O)OC(C)(C)C
InChI Key InChIKey=KVGCZGXPZTZUIK-JCYSWHRNSA-N
Data  1 KI
  Tab Delimited (TSV)   2D SDfile   Computed 3D by Vconf -m prep SDfile
Find this compound or compounds like it in BindingDB:
Activity Spreadsheet -- Enzyme Inhibition Constant Data from BindingDB
Found 1 hit for monomerid = 861
TargetDimer of Gag-Pol polyprotein [489-587](Human immunodeficiency virus type 1)
Sandoz Research Institute
LigandPNGBDBM861(1OH-2(Cbz-Tle)3PhPr [14]paracyclophane deriv. 16 |...)
Affinity DataKi:  14nM ΔG°:  -11.1kcal/molepH: 6.25 T: 2°C. Assay description: Enzymatic activity was measured by following cleavage of the substrate H-Lys-Ala-Arg-Val-Leu-pNph-Glu-Ala-Nle-NH2. Products of the cleavage reaction ...
In DepthDetails ArticlePubMed