BDBM92073 erk000499
SMILES CN(C)c1sc(C#N)c2CCc3cnc(Nc4cccc(O)c4)nc3-c12
InChI Key InChIKey=AGUVBYOGMNUYPF-UHFFFAOYSA-N
Data  2 KI
PDB links: 1 PDB ID matches this monomer.
  Tab Delimited (TSV)   2D SDfile   Computed 3D by Vconf -m prep SDfile
Find this compound or compounds like it in BindingDB:
Activity Spreadsheet -- Enzyme Inhibition Constant Data from BindingDB
Found 2 hits for monomerid = 92073
TargetMitogen-activated protein kinase 1(Homo sapiens (Human))
D3R/Abbott
LigandPNGBDBM92073(erk000499)
Affinity DataKi:  39.8nM. Assay description: Photometric_Method2
TargetMitogen-activated protein kinase 1(Homo sapiens (Human))
D3R/Abbott
LigandPNGBDBM92073(erk000499)
Affinity DataKi:  40nM. Assay description: Assay 1 ...