BDBM92287 uPa_10
SMILES COC(=O)Nc1cccc2ccc(cc12)C(N)=N
InChI Key InChIKey=QRWVPIXNCDJOGY-UHFFFAOYSA-N
Data  3 KI
PDB links: 1 PDB ID matches this monomer.
  Tab Delimited (TSV)   2D SDfile   Computed 3D by Vconf -m prep SDfile
Find this compound or compounds like it in BindingDB:
Activity Spreadsheet -- Enzyme Inhibition Constant Data from BindingDB
Found 3 hits for monomerid = 92287
TargetUrokinase-type plasminogen activator(Homo sapiens (Human))
Csar
LigandPNGBDBM92287(uPa_10)
Affinity DataKi:  40nM ΔG°:  -10.1kcal/molepH: 7.4 T: 2°C. Assay description: Abbott uPA__Urokinase Human - Ki(uM)
TargetUrokinase-type plasminogen activator(Homo sapiens (Human))
Csar
LigandPNGBDBM92287(uPa_10)
Affinity DataKi:  40nM. Assay description: Inhibition of urokinase
LigandPNGBDBM92287(uPa_10)
Affinity DataKi:  40nM. Assay description: Photometric_Method1