BDBM94736 3-(4-chlorophenyl)-5-methyl-N-(2-pyridinylmethyl)-7-pyrazolo[1,5-a]pyrimidinamine::3-(4-chlorophenyl)-5-methyl-N-(pyridin-2-ylmethyl)pyrazolo[1,5-a]pyrimidin-7-amine::MLS000762860::SMR000439715::[3-(4-Chloro-phenyl)-5-methyl-pyrazolo[1,5-a]pyrimidin-7-yl]-pyridin-2-ylmethyl-amine::[3-(4-chlorophenyl)-5-methyl-pyrazolo[1,5-a]pyrimidin-7-yl]-(2-pyridylmethyl)amine::cid_1835852
SMILES Cc1cc(NCc2ccccn2)n2ncc(-c3ccc(Cl)cc3)c2n1
InChI Key InChIKey=HREVLIWZBBVYHV-UHFFFAOYSA-N
Data  1 EC50
  Tab Delimited (TSV)   2D SDfile   Computed 3D by Vconf -m prep SDfile
Find this compound or compounds like it in BindingDB:
Activity Spreadsheet -- Enzyme Inhibition Constant Data from BindingDB
Found 1 hit for monomerid = 94736
TargetXylosyl- and glucuronyltransferase LARGE1(Homo sapiens (Human))
Burnham Center For Chemical Genomics
Curated by PubChem BioAssay
LigandPNGBDBM94736(3-(4-chlorophenyl)-5-methyl-N-(2-pyridinylmethyl)-...)
Affinity DataEC50:  3.48E+3nM
In DepthDetails PCBioAssay