Target
Nuclear receptor ROR-gamma
Ligand
BDBM302131
Substrate
Meas. Tech.
Reporter Gene Assay
IC50
2900±n/a nM
Citation
 Bakonyi, JBrunette, SRCollin, DHughes, ROLi, XLiang, SSibley, RTurner, MRWu, LZhang, Q Compounds as modulators of RORγ US Patent  US9598415 Publication Date 3/21/2017 
Target
Name:
Nuclear receptor ROR-gamma
Synonyms:
NR1F3 Nuclear receptor ROR-gamma (RORC) RAR-related orphan receptor C (RORc) RORG RZRG Retinoid-related orphan receptor-gamma (RORc)
Type:
Enzyme Catalytic Domain
Mol. Mass.:
58218.40
Organism:
Homo sapiens (Human)
Description:
P51449
Residue:
518
  
Inhibitor
Name:
BDBM302131
Synonyms:
US9598415, 45
Type:
Small organic molecule
Emp. Form.:
C26H27N7O3S
Mol. Mass.:
517.603
SMILES:
CCS(=O)(=O)c1ccc(CNc2nc3cnc(nc3n(C3CC3)c2=O)-c2c(C)ncnc2C2CC2)cc1
: