Target
Nuclear receptor ROR-gamma
Ligand
BDBM302347
Substrate
Meas. Tech.
Reporter Gene Assay
IC50
190±n/a nM
Citation
 Bakonyi, JBrunette, SRCollin, DHughes, ROLi, XLiang, SSibley, RTurner, MRWu, LZhang, Q Compounds as modulators of RORγ US Patent  US9598415 Publication Date 3/21/2017 
Target
Name:
Nuclear receptor ROR-gamma
Synonyms:
NR1F3 Nuclear receptor ROR-gamma (RORC) RAR-related orphan receptor C (RORc) RORG RZRG Retinoid-related orphan receptor-gamma (RORc)
Type:
Enzyme Catalytic Domain
Mol. Mass.:
58218.40
Organism:
Homo sapiens (Human)
Description:
P51449
Residue:
518
  
Inhibitor
Name:
BDBM302347
Synonyms:
US9598415, 259
Type:
Small organic molecule
Emp. Form.:
C25H28N8O4S
Mol. Mass.:
536.606
SMILES:
COc1ncnc(C2CC2)c1-c1ncc2nc(NCc3ccc(cn3)S(C)(=O)=O)c(=O)n(CC(C)C)c2n1
: