Target
Proto-oncogene tyrosine-protein kinase receptor Ret
Ligand
BDBM311576
Substrate
Meas. Tech.
Measurement of Inhibitory Activity Against RET (In Vitro)
IC50
0.700±n/a nM
Citation
 Miyazaki, IShimamura, TKato, MFujita, HIguchi, S Fused pyrimidine compound or salt thereof US Patent  US11046696 Publication Date 6/29/2021 
Target
Name:
Proto-oncogene tyrosine-protein kinase receptor Ret
Synonyms:
CDHF12 Cadherin family member 12 Proto-oncogene c-Ret RET51 Tyrosine-protein kinase Ret (RET)
Type:
Protein
Mol. Mass.:
124318.29
Organism:
Homo sapiens (Human)
Description:
P07949
Residue:
1114
  
Inhibitor
Name:
BDBM311576
Synonyms:
Ex. Cpd. 13 US11046696, Compound 13
Type:
Small organic molecule
Emp. Form.:
C18H20N6OS
Mol. Mass.:
368.456
SMILES:
CSCc1ccc(NC(=O)c2nn(C3CCC3)c3ncnc(N)c23)cc1
: