Target
Kinesin-like protein KIF11
Ligand
BDBM509098
Substrate
Meas. Tech.
Inhibition Assay
IC50
1.11±n/a nM
Citation
 Lerchen, HRebstock, ACancho Grande, YWittrock, SBerndt, SGritzan, UFitting, JStelte-Ludwig, BJones, PMahlert, CVotsmeier, CSchönfeld, DTrautwein, MWeber, EPawlowski, NGreven, SGlück, JMHammer, SDietz, LMärsch, S Antibody drug conjugates of kinesin spindel protein (KSP) inhibitors with antiB7H3-antibodies US Patent  US11071788 Publication Date 7/27/2021 
Target
Name:
Kinesin-like protein KIF11
Synonyms:
EG5 KIF11_HUMAN Kinesin Spindle Protein Eg5 TRIP5 | kinesin spindle protein
Type:
PROTEIN
Mol. Mass.:
119138.97
Organism:
Homo sapiens (Human)
Description:
ChEMBL_1457426
Residue:
1056
  
Inhibitor
Name:
BDBM509098
Synonyms:
S-{2-[(3-Aminopropyl){(1R)-1-[1-benzyl-4-(2,5-difluorophenyl)-1H-pyrrol-2-yl]-2,2-dimethyl-propyl}amino]-2-oxoethyl}-L-cysteine/trifluoroacetic acid (1:2) | US11071788, Example M11
Type:
Small organic molecule
Emp. Form.:
C30H38F2N4O3S
Mol. Mass.:
572.71
SMILES:
CC(C)(C)[C@@H](N(CCCN)C(=O)CSC[C@H](N)C(O)=O)c1cc(cn1Cc1ccccc1)-c1cc(F)ccc1F
: