Target
Kinesin-like protein KIF11
Ligand
BDBM509104
Substrate
Meas. Tech.
Inhibition Assay
IC50
4.17±n/a nM
Citation
 Lerchen, HRebstock, ACancho Grande, YWittrock, SBerndt, SGritzan, UFitting, JStelte-Ludwig, BJones, PMahlert, CVotsmeier, CSchönfeld, DTrautwein, MWeber, EPawlowski, NGreven, SGlück, JMHammer, SDietz, LMärsch, S Antibody drug conjugates of kinesin spindel protein (KSP) inhibitors with antiB7H3-antibodies US Patent  US11071788 Publication Date 7/27/2021 
Target
Name:
Kinesin-like protein KIF11
Synonyms:
EG5 KIF11_HUMAN Kinesin Spindle Protein Eg5 TRIP5 | kinesin spindle protein
Type:
PROTEIN
Mol. Mass.:
119138.97
Organism:
Homo sapiens (Human)
Description:
ChEMBL_1457426
Residue:
1056
  
Inhibitor
Name:
BDBM509104
Synonyms:
(2S)-2-Amino-4-[{(1R)-1-[1-benzyl-4-(2,5-difluorophenyl)-1H-pyrrol-2-yl]-2,2-dimethylpropyl}(glycoloyl)amino]butanoic acid hydrochloride (1.1) | US11071788, Example M17
Type:
Small organic molecule
Emp. Form.:
C28H33F2N3O4
Mol. Mass.:
513.5761
SMILES:
CC(C)(C)[C@@H](N(CC[C@H](N)C(O)=O)C(=O)CO)c1cc(cn1Cc1ccccc1)-c1cc(F)ccc1F
: