Target
5'-nucleotidase
Ligand
BDBM511076
Substrate
Meas. Tech.
Inhibition of the CD73 Enzyme In Vitro
IC50
0.170±n/a nM
Citation
 Chen, LBilledeau, RJLi, J Ectonucleotidase inhibitors and methods of use thereof US Patent  US11078228 Publication Date 8/3/2021 
Target
Name:
5'-nucleotidase
Synonyms:
5'-NT 5NTD_HUMAN Ecto-5'-nucleotidase NT5 NTE
Type:
Enzyme
Mol. Mass.:
63371.54
Organism:
Homo sapiens (Human)
Description:
P21589
Residue:
574
  
Inhibitor
Name:
BDBM511076
Synonyms:
2-(((2R,3S,4R,5R)-5-(6-amino-2-chloro-9H-purin-9-yl)-3-ethynyl-3,4-dihydroxytetrahydrofuran-2-yl)methoxy)-2-(4-(2-oxotetrahydropyrimidin-1 (2H)-yl)benzyl)malonic acid | US11078228, Example 9
Type:
Small organic molecule
Emp. Form.:
C26H26ClN7O9
Mol. Mass.:
615.979
SMILES:
Nc1nc(Cl)nc2n(cnc12)[C@@H]1O[C@H](COC(Cc2ccc(cc2)N2CCCNC2=O)(C(O)=O)C(O)=O)[C@](O)(C#C)[C@H]1O
: