Target
5'-nucleotidase
Ligand
BDBM511228
Substrate
Meas. Tech.
Inhibition of the CD73 Enzyme In Vitro
IC50
0.050±n/a nM
Citation
 Chen, LBilledeau, RJLi, J Ectonucleotidase inhibitors and methods of use thereof US Patent  US11078228 Publication Date 8/3/2021 
Target
Name:
5'-nucleotidase
Synonyms:
5'-NT 5NTD_HUMAN Ecto-5'-nucleotidase NT5 NTE
Type:
Enzyme
Mol. Mass.:
63371.54
Organism:
Homo sapiens (Human)
Description:
P21589
Residue:
574
  
Inhibitor
Name:
BDBM511228
Synonyms:
2-(((2R,3S,4R,5R)-5-(6-amino-2-chloro-9H-purin-9-yl)-3-ethynyl-3,4-dihydroxytetrahydrofuran-2-yl)methoxy)-2-(4-(2-oxo-3-propyltetrahydropyrimidin-1 (2H)-yl)benzyl)malonic acid | US11078228, Example 152
Type:
Small organic molecule
Emp. Form.:
C29H32ClN7O9
Mol. Mass.:
658.059
SMILES:
CCCN1CCCN(C1=O)c1ccc(CC(OC[C@H]2O[C@H]([C@H](O)[C@@]2(O)C#C)n2cnc3c(N)nc(Cl)nc23)(C(O)=O)C(O)=O)cc1
: