Target
Ubiquitin carboxyl-terminal hydrolase 30
Ligand
BDBM511941
Substrate
Meas. Tech.
Biochemical Assay
IC50
5500±n/a nM
Citation
 Stockley, MLKemp, MIMadin, A Cyanopyrrolidine derivatives with activity as inhibitors of USP30 US Patent  US11084821 Publication Date 8/10/2021 
Target
Name:
Ubiquitin carboxyl-terminal hydrolase 30
Synonyms:
Deubiquitinating enzyme 30 USP30 Ubiquitin carboxyl-terminal hydrolase 30 (USP30) Ubiquitin-specific-processing protease 30
Type:
Protein
Mol. Mass.:
58522.90
Organism:
Homo sapiens (Human)
Description:
Q70CQ3
Residue:
517
  
Inhibitor
Name:
BDBM511941
Synonyms:
1-Phenylhexahydropyrrolo[3,4-b]pyrrole-5(1H)-carbonitrile | US11084821, Example 1
Type:
Small organic molecule
Emp. Form.:
C13H15N3
Mol. Mass.:
213.2783
SMILES:
N#CN1CC2CCN(C2C1)c1ccccc1
: