Target
Ubiquitin carboxyl-terminal hydrolase 30
Ligand
BDBM512273
Substrate
Meas. Tech.
Biochemical Assay
IC50
5500±n/a nM
Citation
 Stockley, MLKemp, MIMadin, A Cyanopyrrolidine derivatives with activity as inhibitors of USP30 US Patent  US11084821 Publication Date 8/10/2021 
Target
Name:
Ubiquitin carboxyl-terminal hydrolase 30
Synonyms:
Deubiquitinating enzyme 30 USP30 Ubiquitin carboxyl-terminal hydrolase 30 (USP30) Ubiquitin-specific-processing protease 30
Type:
Protein
Mol. Mass.:
58522.90
Organism:
Homo sapiens (Human)
Description:
Q70CQ3
Residue:
517
  
Inhibitor
Name:
BDBM512273
Synonyms:
US11084821, Example 3 | cis-4-(6-Fluorobenzo[d]thiazol-2- yl)hexahydropyrrolo[3,4-b][1,4]oxazine- 6(2H)-carbonitrile
Type:
Small organic molecule
Emp. Form.:
C14H13FN4OS
Mol. Mass.:
304.343
SMILES:
Fc1ccc2nc(sc2c1)N1CCO[C@H]2CN(C[C@@H]12)C#N
: