Target
Ubiquitin carboxyl-terminal hydrolase 30
Ligand
BDBM512280
Substrate
Meas. Tech.
Biochemical Assay
IC50
550±n/a nM
Citation
 Stockley, MLKemp, MIMadin, A Cyanopyrrolidine derivatives with activity as inhibitors of USP30 US Patent  US11084821 Publication Date 8/10/2021 
Target
Name:
Ubiquitin carboxyl-terminal hydrolase 30
Synonyms:
Deubiquitinating enzyme 30 USP30 Ubiquitin carboxyl-terminal hydrolase 30 (USP30) Ubiquitin-specific-processing protease 30
Type:
Protein
Mol. Mass.:
58522.90
Organism:
Homo sapiens (Human)
Description:
Q70CQ3
Residue:
517
  
Inhibitor
Name:
BDBM512280
Synonyms:
US11084821, Example 10 | trans-4-(5-Phenylthiazol-2-yl)hexahydropyrrolo[3,4-b][1,4]oxazine-6(2H)-carbonitrile
Type:
Small organic molecule
Emp. Form.:
C16H16N4OS
Mol. Mass.:
312.389
SMILES:
N#CN1C[C@H]2OCCN([C@@H]2C1)c1ncc(s1)-c1ccccc1
: