Target
Ubiquitin carboxyl-terminal hydrolase 30
Ligand
BDBM512281
Substrate
Meas. Tech.
Biochemical Assay
IC50
5500±n/a nM
Citation
 Stockley, MLKemp, MIMadin, A Cyanopyrrolidine derivatives with activity as inhibitors of USP30 US Patent  US11084821 Publication Date 8/10/2021 
Target
Name:
Ubiquitin carboxyl-terminal hydrolase 30
Synonyms:
Deubiquitinating enzyme 30 USP30 Ubiquitin carboxyl-terminal hydrolase 30 (USP30) Ubiquitin-specific-processing protease 30
Type:
Protein
Mol. Mass.:
58522.90
Organism:
Homo sapiens (Human)
Description:
Q70CQ3
Residue:
517
  
Inhibitor
Name:
BDBM512281
Synonyms:
1-(5-Phenylthiazol-2-yl)octahydro-6H-pyrrolo[3,4-b]pyridine-6-carbonitrile | US11084821, Example 11
Type:
Small organic molecule
Emp. Form.:
C17H18N4S
Mol. Mass.:
310.417
SMILES:
N#CN1CC2CCCN(C2C1)c1ncc(s1)-c1ccccc1
: