Target
Ubiquitin carboxyl-terminal hydrolase 30
Ligand
BDBM512284
Substrate
Meas. Tech.
Biochemical Assay
IC50
5500±n/a nM
Citation
 Stockley, MLKemp, MIMadin, A Cyanopyrrolidine derivatives with activity as inhibitors of USP30 US Patent  US11084821 Publication Date 8/10/2021 
Target
Name:
Ubiquitin carboxyl-terminal hydrolase 30
Synonyms:
Deubiquitinating enzyme 30 USP30 Ubiquitin carboxyl-terminal hydrolase 30 (USP30) Ubiquitin-specific-processing protease 30
Type:
Protein
Mol. Mass.:
58522.90
Organism:
Homo sapiens (Human)
Description:
Q70CQ3
Residue:
517
  
Inhibitor
Name:
BDBM512284
Synonyms:
3-(Methyl(5-phenylthiazol-2-yl)amino)pyrrolidine-1-carbonitrile | US11084821, Example 13
Type:
Small organic molecule
Emp. Form.:
C15H16N4S
Mol. Mass.:
284.379
SMILES:
CN(C1CCN(C1)C#N)c1ncc(s1)-c1ccccc1
: