Target
Ubiquitin carboxyl-terminal hydrolase 30
Ligand
BDBM512286
Substrate
Meas. Tech.
Biochemical Assay
IC50
55±n/a nM
Citation
 Stockley, MLKemp, MIMadin, A Cyanopyrrolidine derivatives with activity as inhibitors of USP30 US Patent  US11084821 Publication Date 8/10/2021 
Target
Name:
Ubiquitin carboxyl-terminal hydrolase 30
Synonyms:
Deubiquitinating enzyme 30 USP30 Ubiquitin carboxyl-terminal hydrolase 30 (USP30) Ubiquitin-specific-processing protease 30
Type:
Protein
Mol. Mass.:
58522.90
Organism:
Homo sapiens (Human)
Description:
Q70CQ3
Residue:
517
  
Inhibitor
Name:
BDBM512286
Synonyms:
(3aR,6aR)-1-(6-(Trifluoromethoxy)-1H-benzo[d]imidazol-2-yl)hexahydropyrrolo[3,4-b]pyrrole-5(1H)-carbonitrile | US11084821, Example 15
Type:
Small organic molecule
Emp. Form.:
C15H14F3N5O
Mol. Mass.:
337.2998
SMILES:
FC(F)(F)Oc1ccc2nc([nH]c2c1)N1CC[C@@H]2CN(C[C@H]12)C#N
: