Target
Ubiquitin carboxyl-terminal hydrolase 30
Ligand
BDBM512287
Substrate
Meas. Tech.
Biochemical Assay
IC50
550±n/a nM
Citation
 Stockley, MLKemp, MIMadin, A Cyanopyrrolidine derivatives with activity as inhibitors of USP30 US Patent  US11084821 Publication Date 8/10/2021 
Target
Name:
Ubiquitin carboxyl-terminal hydrolase 30
Synonyms:
Deubiquitinating enzyme 30 USP30 Ubiquitin carboxyl-terminal hydrolase 30 (USP30) Ubiquitin-specific-processing protease 30
Type:
Protein
Mol. Mass.:
58522.90
Organism:
Homo sapiens (Human)
Description:
Q70CQ3
Residue:
517
  
Inhibitor
Name:
BDBM512287
Synonyms:
2-((3aR,6aR)-5-Cyanohexahydropyrrolo[3,4-b]pyrrol-1(2H)-yl)-1H-benzo[d]imidazole-6-carbonitrile | US11084821, Example 16
Type:
Small organic molecule
Emp. Form.:
C15H14N6
Mol. Mass.:
278.3119
SMILES:
N#CN1C[C@H]2CCN([C@H]2C1)c1nc2ccc(cc2[nH]1)C#N
: