Target
Ubiquitin carboxyl-terminal hydrolase 30
Ligand
BDBM512289
Substrate
Meas. Tech.
Biochemical Assay
IC50
550±n/a nM
Citation
 Stockley, MLKemp, MIMadin, A Cyanopyrrolidine derivatives with activity as inhibitors of USP30 US Patent  US11084821 Publication Date 8/10/2021 
Target
Name:
Ubiquitin carboxyl-terminal hydrolase 30
Synonyms:
Deubiquitinating enzyme 30 USP30 Ubiquitin carboxyl-terminal hydrolase 30 (USP30) Ubiquitin-specific-processing protease 30
Type:
Protein
Mol. Mass.:
58522.90
Organism:
Homo sapiens (Human)
Description:
Q70CQ3
Residue:
517
  
Inhibitor
Name:
BDBM512289
Synonyms:
(R)-3-(Methyl(6-(trifluoromethyl)-1H-benzo[d]imidazol-2-yl)amino)pyrrolidine-1-carbonitrile | US11084821, Example 18
Type:
Small organic molecule
Emp. Form.:
C14H14F3N5
Mol. Mass.:
309.2897
SMILES:
CN([C@@H]1CCN(C1)C#N)c1nc2ccc(cc2[nH]1)C(F)(F)F
: