Target
Tyrosine-protein kinase BTK
Ligand
BDBM512350
Substrate
Meas. Tech.
Inhibitory Assay
IC50
0.600±n/a nM
Citation
 Kim, PCho, SYHa, JDKim, HRHwang, JYYun, CSJung, HJPark, CHLee, COLee, CHAhn, S Pyrazolopyrimidine derivatives, preparation method thereof, and pharmaceutical composition for use in preventing or treating cancer, autoimmune disease and brain disease containing the same as an active ingredient US Patent  US11084824 Publication Date 8/10/2021 
Target
Name:
Tyrosine-protein kinase BTK
Synonyms:
AGMX1 Agammaglobulinaemia tyrosine kinase B cell progenitor kinase BPK BTK_HUMAN Tyrosine Kinase BTK Tyrosine-protein kinase BTK (BTK)
Type:
Enzyme
Mol. Mass.:
76289.95
Organism:
Homo sapiens (Human)
Description:
Q06187
Residue:
659
  
Inhibitor
Name:
BDBM512350
Synonyms:
US11084824, Example 1
Type:
Small organic molecule
Emp. Form.:
C25H27N7O
Mol. Mass.:
441.5282
SMILES:
CC(=O)N1CCc2ccc(Nc3ncc4c(Nc5c(C)cccc5C)nn(C)c4n3)cc2C1
: