Target
Tyrosine-protein kinase BTK
Ligand
BDBM512360
Substrate
Meas. Tech.
Inhibitory Assay
IC50
0.670±n/a nM
Citation
 Kim, PCho, SYHa, JDKim, HRHwang, JYYun, CSJung, HJPark, CHLee, COLee, CHAhn, S Pyrazolopyrimidine derivatives, preparation method thereof, and pharmaceutical composition for use in preventing or treating cancer, autoimmune disease and brain disease containing the same as an active ingredient US Patent  US11084824 Publication Date 8/10/2021 
Target
Name:
Tyrosine-protein kinase BTK
Synonyms:
AGMX1 Agammaglobulinaemia tyrosine kinase B cell progenitor kinase BPK BTK_HUMAN Tyrosine Kinase BTK Tyrosine-protein kinase BTK (BTK)
Type:
Enzyme
Mol. Mass.:
76289.95
Organism:
Homo sapiens (Human)
Description:
Q06187
Residue:
659
  
Inhibitor
Name:
BDBM512360
Synonyms:
Preparation of N3-(2,6-dichlorophenyl)-1-methyl-N6-(1,2,3,4-tetrahydroisoquinoline-6-yl)-1H-pyrazolo[3,4-d]pyrimidine-3,6-diamine | US11084824, Example 15
Type:
Small organic molecule
Emp. Form.:
C21H19Cl2N7
Mol. Mass.:
440.328
SMILES:
Cn1nc(Nc2c(Cl)cccc2Cl)c2cnc(Nc3ccc4CNCCc4c3)nc12
: