Target
Tyrosine-protein kinase BTK
Ligand
BDBM512363
Substrate
Meas. Tech.
Inhibitory Assay
IC50
0.500±n/a nM
Citation
 Kim, PCho, SYHa, JDKim, HRHwang, JYYun, CSJung, HJPark, CHLee, COLee, CHAhn, S Pyrazolopyrimidine derivatives, preparation method thereof, and pharmaceutical composition for use in preventing or treating cancer, autoimmune disease and brain disease containing the same as an active ingredient US Patent  US11084824 Publication Date 8/10/2021 
Target
Name:
Tyrosine-protein kinase BTK
Synonyms:
AGMX1 Agammaglobulinaemia tyrosine kinase B cell progenitor kinase BPK BTK_HUMAN Tyrosine Kinase BTK Tyrosine-protein kinase BTK (BTK)
Type:
Enzyme
Mol. Mass.:
76289.95
Organism:
Homo sapiens (Human)
Description:
Q06187
Residue:
659
  
Inhibitor
Name:
BDBM512363
Synonyms:
US11084824, Example 18
Type:
Small organic molecule
Emp. Form.:
C23H24N6O
Mol. Mass.:
400.4763
SMILES:
Cc1cccc(C)c1Nc1nn(C)c2nc(Nc3ccc4CCOCc4c3)ncc12
: