Target
Tyrosine-protein kinase BTK
Ligand
BDBM512369
Substrate
Meas. Tech.
Inhibitory Assay
IC50
0.300±n/a nM
Citation
 Kim, PCho, SYHa, JDKim, HRHwang, JYYun, CSJung, HJPark, CHLee, COLee, CHAhn, S Pyrazolopyrimidine derivatives, preparation method thereof, and pharmaceutical composition for use in preventing or treating cancer, autoimmune disease and brain disease containing the same as an active ingredient US Patent  US11084824 Publication Date 8/10/2021 
Target
Name:
Tyrosine-protein kinase BTK
Synonyms:
AGMX1 Agammaglobulinaemia tyrosine kinase B cell progenitor kinase BPK BTK_HUMAN Tyrosine Kinase BTK Tyrosine-protein kinase BTK (BTK)
Type:
Enzyme
Mol. Mass.:
76289.95
Organism:
Homo sapiens (Human)
Description:
Q06187
Residue:
659
  
Inhibitor
Name:
BDBM512369
Synonyms:
US11084824, Example 24
Type:
Small organic molecule
Emp. Form.:
C26H30N6O
Mol. Mass.:
442.556
SMILES:
CC1N=C(Nc2c(C)cccc2C)c2cnc(Nc3ccc4CCN(CCO)Cc4c3)nc12
: