Target
Tyrosine-protein kinase BTK
Ligand
BDBM512370
Substrate
Meas. Tech.
Inhibitory Assay
IC50
0.300±n/a nM
Citation
 Kim, PCho, SYHa, JDKim, HRHwang, JYYun, CSJung, HJPark, CHLee, COLee, CHAhn, S Pyrazolopyrimidine derivatives, preparation method thereof, and pharmaceutical composition for use in preventing or treating cancer, autoimmune disease and brain disease containing the same as an active ingredient US Patent  US11084824 Publication Date 8/10/2021 
Target
Name:
Tyrosine-protein kinase BTK
Synonyms:
AGMX1 Agammaglobulinaemia tyrosine kinase B cell progenitor kinase BPK BTK_HUMAN Tyrosine Kinase BTK Tyrosine-protein kinase BTK (BTK)
Type:
Enzyme
Mol. Mass.:
76289.95
Organism:
Homo sapiens (Human)
Description:
Q06187
Residue:
659
  
Inhibitor
Name:
BDBM512370
Synonyms:
US11084824, Example 25
Type:
Small organic molecule
Emp. Form.:
C27H31N7
Mol. Mass.:
453.5819
SMILES:
Cc1cccc(C)c1Nc1nn(C2CCCC2)c2nc(Nc3ccc4CCNCc4c3)ncc12
: