Target
Tyrosine-protein kinase BTK
Ligand
BDBM512376
Substrate
Meas. Tech.
Inhibitory Assay
IC50
0.800±n/a nM
Citation
 Kim, PCho, SYHa, JDKim, HRHwang, JYYun, CSJung, HJPark, CHLee, COLee, CHAhn, S Pyrazolopyrimidine derivatives, preparation method thereof, and pharmaceutical composition for use in preventing or treating cancer, autoimmune disease and brain disease containing the same as an active ingredient US Patent  US11084824 Publication Date 8/10/2021 
Target
Name:
Tyrosine-protein kinase BTK
Synonyms:
AGMX1 Agammaglobulinaemia tyrosine kinase B cell progenitor kinase BPK BTK_HUMAN Tyrosine Kinase BTK Tyrosine-protein kinase BTK (BTK)
Type:
Enzyme
Mol. Mass.:
76289.95
Organism:
Homo sapiens (Human)
Description:
Q06187
Residue:
659
  
Inhibitor
Name:
BDBM512376
Synonyms:
US11084824, Example 31
Type:
Small organic molecule
Emp. Form.:
C27H34N8O
Mol. Mass.:
486.6119
SMILES:
CCc1ccc(Nc2ncc3c(Nc4c(C)cccc4C)nn(C)c3n2)cc1CNC(=O)CN(C)C
: