Target
Tyrosine-protein kinase BTK
Ligand
BDBM512390
Substrate
Meas. Tech.
Inhibitory Assay
IC50
0.847±n/a nM
Citation
 Kim, PCho, SYHa, JDKim, HRHwang, JYYun, CSJung, HJPark, CHLee, COLee, CHAhn, S Pyrazolopyrimidine derivatives, preparation method thereof, and pharmaceutical composition for use in preventing or treating cancer, autoimmune disease and brain disease containing the same as an active ingredient US Patent  US11084824 Publication Date 8/10/2021 
Target
Name:
Tyrosine-protein kinase BTK
Synonyms:
AGMX1 Agammaglobulinaemia tyrosine kinase B cell progenitor kinase BPK BTK_HUMAN Tyrosine Kinase BTK Tyrosine-protein kinase BTK (BTK)
Type:
Enzyme
Mol. Mass.:
76289.95
Organism:
Homo sapiens (Human)
Description:
Q06187
Residue:
659
  
Inhibitor
Name:
BDBM512390
Synonyms:
Preparation of N3-(2,6-dimethylphenyl)-1-methyl-N 6-(1,3,3-trimethyl-1,2,3,4-tetrahydroisoquinoline-7-yl)-1H-pyrazolo[3,4-d]pyrimidine-3,6-diamine | US11084824, Example 55
Type:
Small organic molecule
Emp. Form.:
C25H29N7
Mol. Mass.:
427.5447
SMILES:
CC1Cc2ccc(Nc3ncc4c(Nc5c(C)cccc5C)nn(C)c4n3)cc2C(C)N1
: