Target
Tyrosine-protein kinase BTK
Ligand
BDBM512392
Substrate
Meas. Tech.
Inhibitory Assay
IC50
0.745±n/a nM
Citation
 Kim, PCho, SYHa, JDKim, HRHwang, JYYun, CSJung, HJPark, CHLee, COLee, CHAhn, S Pyrazolopyrimidine derivatives, preparation method thereof, and pharmaceutical composition for use in preventing or treating cancer, autoimmune disease and brain disease containing the same as an active ingredient US Patent  US11084824 Publication Date 8/10/2021 
Target
Name:
Tyrosine-protein kinase BTK
Synonyms:
AGMX1 Agammaglobulinaemia tyrosine kinase B cell progenitor kinase BPK BTK_HUMAN Tyrosine Kinase BTK Tyrosine-protein kinase BTK (BTK)
Type:
Enzyme
Mol. Mass.:
76289.95
Organism:
Homo sapiens (Human)
Description:
Q06187
Residue:
659
  
Inhibitor
Name:
BDBM512392
Synonyms:
Preparation of N3-(2,6-dimethylphenyl)-N6-(isoindolin-5-yl)-1-methyl-1H-pyrazolo[3,4-d]pyrimidine-3,6-diamine hydrochloride | US11084824, Example 56
Type:
Small organic molecule
Emp. Form.:
C22H23N7
Mol. Mass.:
385.4649
SMILES:
Cc1cccc(C)c1Nc1nn(C)c2nc(Nc3ccc4CNCc4c3)ncc12
: