Target
Replicase polyprotein 1ab
Ligand
BDBM45755
Substrate
Meas. Tech.
Various Assay
IC50
380±n/a nM
Citation
 Gao, KWang, RChen, JTepe, JJHuang, FWei, GW Perspectives on SARS-CoV-2 Main Protease Inhibitors. J Med Chem 64:16922-16955 (2021)  
Target
Name:
Replicase polyprotein 1ab
Synonyms:
ORF1ab polyprotein pp1ab | rep
Type:
Protein
Mol. Mass.:
794070.71
Organism:
2019-nCoV
Description:
P0DTD1
Residue:
7096
  
Inhibitor
Name:
BDBM45755
Synonyms:
AB00540084 N-(2-furfuryl)-4-(3-keto-1,2-benzothiazol-2-yl)benzamide N-(furan-2-ylmethyl)-4-(3-oxo-1,2-benzothiazol-2-yl)benzamide cid_16749979
Type:
Small organic molecule
Emp. Form.:
C19H14N2O3S
Mol. Mass.:
350.391
SMILES:
O=C(NCc1ccco1)c1ccc(cc1)-n1sc2ccccc2c1=O
: