Target
Tyrosine-protein kinase receptor TYRO3
Ligand
BDBM515799
Substrate
Meas. Tech.
Verification on Inhibitory Activities of TAM Receptor Inhibiting Compounds on Tyro 3, Axl, and Mer
IC50
0.190±n/a nM
Citation
 Cho, SYLee, CHMin, YKHwang, JY Pyrimidine derivative compound, optical isomer thereof, or pharmaceutically acceptable salt thereof, and composition for preventing or treating Tyro 3 related disease comprising same as active ingredient US Patent  US11053225 Publication Date 7/6/2021 
Target
Name:
Tyrosine-protein kinase receptor TYRO3
Synonyms:
BYK RSE TIF TYRO3_HUMAN | Tyrosine-protein kinase SKY
Type:
Protein
Mol. Mass.:
96894.13
Organism:
Homo sapiens (Human)
Description:
Q06418
Residue:
890
  
Inhibitor
Name:
BDBM515799
Synonyms:
US11053225, Compound 103
Type:
Small organic molecule
Emp. Form.:
C21H25Cl2N7O
Mol. Mass.:
462.376
SMILES:
N[C@H]1CC[C@H](CC1)Nc1nc(Nc2cc(Cl)cc(Cl)c2)ncc1-c1cnn(CCO)c1
: