Target
Tyrosine-protein kinase receptor TYRO3
Ligand
BDBM515846
Substrate
Meas. Tech.
Verification on Inhibitory Activities of TAM Receptor Inhibiting Compounds on Tyro 3, Axl, and Mer
IC50
0.130±n/a nM
Citation
 Cho, SYLee, CHMin, YKHwang, JY Pyrimidine derivative compound, optical isomer thereof, or pharmaceutically acceptable salt thereof, and composition for preventing or treating Tyro 3 related disease comprising same as active ingredient US Patent  US11053225 Publication Date 7/6/2021 
Target
Name:
Tyrosine-protein kinase receptor TYRO3
Synonyms:
BYK RSE TIF TYRO3_HUMAN | Tyrosine-protein kinase SKY
Type:
Protein
Mol. Mass.:
96894.13
Organism:
Homo sapiens (Human)
Description:
Q06418
Residue:
890
  
Inhibitor
Name:
BDBM515846
Synonyms:
US11053225, Compound 147
Type:
Small organic molecule
Emp. Form.:
C24H23ClFN7O
Mol. Mass.:
479.937
SMILES:
OCCn1cc(cn1)-c1cnc(Nc2cc(F)cc(Cl)c2)nc1Nc1ccc2CCNCc2c1
: