Target
Tyrosine-protein kinase receptor TYRO3
Ligand
BDBM515847
Substrate
Meas. Tech.
Verification on Inhibitory Activities of TAM Receptor Inhibiting Compounds on Tyro 3, Axl, and Mer
IC50
0.130±n/a nM
Citation
 Cho, SYLee, CHMin, YKHwang, JY Pyrimidine derivative compound, optical isomer thereof, or pharmaceutically acceptable salt thereof, and composition for preventing or treating Tyro 3 related disease comprising same as active ingredient US Patent  US11053225 Publication Date 7/6/2021 
Target
Name:
Tyrosine-protein kinase receptor TYRO3
Synonyms:
BYK RSE TIF TYRO3_HUMAN | Tyrosine-protein kinase SKY
Type:
Protein
Mol. Mass.:
96894.13
Organism:
Homo sapiens (Human)
Description:
Q06418
Residue:
890
  
Inhibitor
Name:
BDBM515847
Synonyms:
US11053225, Compound 148
Type:
Small organic molecule
Emp. Form.:
C26H26F3N7O2
Mol. Mass.:
525.5255
SMILES:
COc1cc(Nc2ncc(-c3cnn(CCO)c3)c(Nc3ccc4CCNCc4c3)n2)cc(c1)C(F)(F)F
: