Target
Tyrosine-protein kinase receptor TYRO3
Ligand
BDBM515879
Substrate
Meas. Tech.
Verification on Inhibitory Activities of TAM Receptor Inhibiting Compounds on Tyro 3, Axl, and Mer
IC50
0.160±n/a nM
Citation
 Cho, SYLee, CHMin, YKHwang, JY Pyrimidine derivative compound, optical isomer thereof, or pharmaceutically acceptable salt thereof, and composition for preventing or treating Tyro 3 related disease comprising same as active ingredient US Patent  US11053225 Publication Date 7/6/2021 
Target
Name:
Tyrosine-protein kinase receptor TYRO3
Synonyms:
BYK RSE TIF TYRO3_HUMAN | Tyrosine-protein kinase SKY
Type:
Protein
Mol. Mass.:
96894.13
Organism:
Homo sapiens (Human)
Description:
Q06418
Residue:
890
  
Inhibitor
Name:
BDBM515879
Synonyms:
US11053225, Compound 181
Type:
Small organic molecule
Emp. Form.:
C26H27F2N7
Mol. Mass.:
475.5363
SMILES:
CC(C)Cn1cc(cn1)-c1cnc(Nc2cc(F)cc(F)c2)nc1Nc1ccc2CCNCc2c1
: