Target
Fibroblast growth factor receptor 1
Ligand
BDBM301280
Substrate
Meas. Tech.
FGFR Enzymatic Assay
IC50
<100±n/a nM
Citation
 Wu, LZhang, CHe, CLu, LYao, W Substituted tricyclic compounds as FGFR inhibitors US Patent  US11053246 Publication Date 7/6/2021 
Target
Name:
Fibroblast growth factor receptor 1
Synonyms:
BFGFR Basic fibroblast growth factor receptor 1 (FGFR1) CEK FGFR-1 FGFR-1, (FL) FGFR1_HUMAN FLT2 Fibroblast growth factor receptor 1 (FGFR-1) Fms-like tyrosine kinase 2 N-sam bFGF-R | c-fgr
Type:
Receptor
Mol. Mass.:
91861.70
Organism:
Homo sapiens (Human)
Description:
P11362
Residue:
822
  
Inhibitor
Name:
BDBM301280
Synonyms:
3-(2,6-difluoro-3,5-dimethoxyphenyl)-1-quinolin-8-yl-1,3,4,7-tetrahydro-2H-pyrazolo[4',3':5,6]pyrido[4,3-d]pyrimidin-2-one US11053246, Example 96 | US9611267, Example 96
Type:
Small organic molecule
Emp. Form.:
C25H18F2N6O3
Mol. Mass.:
488.4456
SMILES:
COc1cc(OC)c(F)c(N2Cc3cnc4[nH]ncc4c3N(C2=O)c2cccc3cccnc23)c1F
: