Target
Fibroblast growth factor receptor 3
Ligand
BDBM301296
Substrate
Meas. Tech.
FGFR Enzymatic Assay
IC50
<100±n/a nM
Citation
 Wu, LZhang, CHe, CLu, LYao, W Substituted tricyclic compounds as FGFR inhibitors US Patent  US11053246 Publication Date 7/6/2021 
Target
Name:
Fibroblast growth factor receptor 3
Synonyms:
CD_antigen: CD333 FGFR3 Fibroblast growth factor receptor JTK4
Type:
Protein
Mol. Mass.:
87699.57
Organism:
Homo sapiens (Human)
Description:
P22607
Residue:
806
  
Inhibitor
Name:
BDBM301296
Synonyms:
3-(2,6-difluoro-3,5-dimethoxyphenyl)-8-[(4,4-difluoropiperidin-1-yl)methyl]-1-methyl-1,3,4,7-tetrahydro-2H-pyrrolo[3',2':5,6]pyrido[4,3-d]pyrimidin-2-one US11053246, Example 112 | US9611267, Example 112
Type:
Small organic molecule
Emp. Form.:
C24H25F4N5O3
Mol. Mass.:
507.4806
SMILES:
COc1cc(OC)c(F)c(N2Cc3cnc4[nH]c(CN5CCC(F)(F)CC5)cc4c3N(C)C2=O)c1F
: