Target
Bifunctional epoxide hydrolase 2
Ligand
BDBM50100520
Substrate
Meas. Tech.
Assays for Epoxide Hydrolase Activity
Ki
0.660±0.30 nM
Citation
 Hammock, BDMorisseau, CYang, JHashimoto, K Methods of treating mental disorders US Patent  US11123311 Publication Date 9/21/2021 
Target
Name:
Bifunctional epoxide hydrolase 2
Synonyms:
Cytosolic epoxide hydrolase 2 EPHX2 HYES_HUMAN Soluble epoxide hydrolase (sEH) | epoxide hydrolase 2, cytoplasmic
Type:
Enzyme
Mol. Mass.:
62613.07
Organism:
Homo sapiens (Human)
Description:
P34913
Residue:
555
  
Inhibitor
Name:
BDBM50100520
Synonyms:
CHEMBL3327077 US11123311, Compound 2422
Type:
Small organic molecule
Emp. Form.:
C17H22F3N3O3
Mol. Mass.:
373.3701
SMILES:
CC(C)C(=O)N1CCC(CC1)NC(=O)Nc1ccc(OC(F)(F)F)cc1
: