Target
Tyrosine-protein kinase JAK1
Ligand
BDBM279853
Substrate
Meas. Tech.
Biochemical Assay
Ki
0.55±n/a nM
Citation
 Hudson, RKozak, JFleury, MFatheree, PRBeausoleil, APodesto, DDHuang, X Pyrimidine compounds as JAK kinase inhibitors US Patent  US11110095 Publication Date 9/7/2021 
Target
Name:
Tyrosine-protein kinase JAK1
Synonyms:
JAK-1 JAK1A JAK1_HUMAN Janus kinase 1 (JAK1) | Janus kinase 1 JAK1
Type:
Protein
Mol. Mass.:
133293.73
Organism:
Homo sapiens (Human)
Description:
P23458
Residue:
1154
  
Inhibitor
Name:
BDBM279853
Synonyms:
US10028960, Example 3-8 | US11110095, Example 3-8
Type:
Small organic molecule
Emp. Form.:
C23H33N7O3
Mol. Mass.:
455.5532
SMILES:
COc1cc(Nc2cc(CO)[nH]n2)nc(n1)N(C)[C@H]1C[C@@H]2CCC[C@H](C1)N2C(=O)C1CCC1
: