Target
Baculoviral IAP repeat-containing protein 7
Ligand
BDBM518286
Substrate
Meas. Tech.
Biological Assay
Ki
<25000±n/a nM
Citation
 Cosford, NDVamos, MD Inhibitor of apoptosis protein (IAP) antagonists US Patent  US11111270 Publication Date 9/7/2021 
Target
Name:
Baculoviral IAP repeat-containing protein 7
Synonyms:
BIR3 BIRC7_HUMAN KIAP MLIAP | RNF50
Type:
PROTEIN
Mol. Mass.:
32792.04
Organism:
Homo sapiens (Human)
Description:
ChEMBL_624591
Residue:
298
  
Inhibitor
Name:
BDBM518286
Synonyms:
US11111270, Compound 24
Type:
Small organic molecule
Emp. Form.:
C23H32N4O3S
Mol. Mass.:
444.59
SMILES:
CN[C@@H](C)C(=O)N[C@H]1CCS[C@H]2CCC(N2C1=O)C(=O)N[C@@H]1CCCc2ccccc12
: