Target
TGF-beta receptor type-1
Ligand
BDBM518446
Substrate
Meas. Tech.
LanthaScreen Eu Kinase Binding Assay TGFBR1 (ALK5)
IC50
1370±n/a nM
Citation
 Sawyer, JS Tri-substituted imidazoles for the inhibition of TGF beta and methods of treatment US Patent  US11124509 Publication Date 9/21/2021 
Target
Name:
TGF-beta receptor type-1
Synonyms:
ALK-5 Activin A receptor type II-like protein kinase of 53kD SKR4 TGF-beta receptor type I TGFBR1 TGFR1_HUMAN Transforming growth factor-beta receptor type I
Type:
enzyme
Mol. Mass.:
55968.24
Organism:
Homo sapiens (Human)
Description:
P36897
Residue:
503
  
Inhibitor
Name:
BDBM518446
Synonyms:
US11124509, Compound 2
Type:
Small organic molecule
Emp. Form.:
C20H17FN8
Mol. Mass.:
388.401
SMILES:
Cn1ccc(n1)-c1nc(CNc2ccccc2F)[nH]c1-c1ccc2ncnn2c1
: