Target
TGF-beta receptor type-1
Ligand
BDBM518501
Substrate
Meas. Tech.
LanthaScreen Eu Kinase Binding Assay TGFBR1 (ALK5)
IC50
3.00±n/a nM
Citation
 Sawyer, JS Tri-substituted imidazoles for the inhibition of TGF beta and methods of treatment US Patent  US11124509 Publication Date 9/21/2021 
Target
Name:
TGF-beta receptor type-1
Synonyms:
ALK-5 Activin A receptor type II-like protein kinase of 53kD SKR4 TGF-beta receptor type I TGFBR1 TGFR1_HUMAN Transforming growth factor-beta receptor type I
Type:
enzyme
Mol. Mass.:
55968.24
Organism:
Homo sapiens (Human)
Description:
P36897
Residue:
503
  
Inhibitor
Name:
BDBM518501
Synonyms:
US11124509, Compound 69
Type:
Small organic molecule
Emp. Form.:
C22H18F2N8
Mol. Mass.:
432.4287
SMILES:
Fc1cc(F)cc(NCc2nc(-c3ccn(n3)C3CC3)c([nH]2)-c2ccc3ncnn3c2)c1
: